occurrence_id,speciesID,latitude,longitude,donorDatabase,collectionDate,county,recordType,confidence,botanist,projectIdentifier,geoPrecision,truncate,voucher,voucherLocation,verified,weblink,planted,rights,notes,added_date
180252,"Philadelphus coronarius",42.76667,-89.10833,iDigBio,2004-10-10,MCDONOUGH,"herbarium specimen",med-high,"Ribbens, Eric",ca162f57-a851-4841-a43f-2ae8688215ef,10,0,1,MWI,0,https://www.idigbio.org/portal/records/ca162f57-a851-4841-a43f-2ae8688215ef,0,,"Macomb, Western Illinois University, southwest of Sherman Hall by Viburnum opulus",
198253,"Philadelphus coronarius",41.8417,-89.3003,"ILLS (INHS Herbarium)",1950-09-17,LEE,"herbarium specimen",high,"P.D. Voth P.D. Voth","Accession: 225423",,0,1,ILLS,0,NA,0,"written permission","contact ILLS herbarium for additional information about this record",
210508,"Philadelphus coronarius",42.1136,-89.2969,"ILLS (INHS Herbarium)",2004-08-27,OGLE,"herbarium specimen",high,"Steven R. Hill Det.: S.R. Hill (ILLS) 2004","Accession: 237528",,0,1,ILLS,0,NA,0,"written permission","contact ILLS herbarium for additional information about this record",
275298,"Philadelphus coronarius",,,"ILLS (INHS Herbarium)",1947-06-25,CHAMPAIGN,"herbarium specimen",high,"Grace Loescher","Accession: 29903",,0,1,ILLS,0,NA,0,"written permission","contact ILLS herbarium for additional information about this record",
275299,"Philadelphus coronarius",,,"ILLS (INHS Herbarium)",1980-05-31,CHAMPAIGN,"herbarium specimen",high,"Judith DeShurko","Accession: 164204",,0,1,ILLS,0,NA,0,"written permission","contact ILLS herbarium for additional information about this record",
275300,"Philadelphus coronarius",,,"ILLS (INHS Herbarium)",1979-03-04,CHAMPAIGN,"herbarium specimen",high,"Judith DeShurko","Accession: 163759",,0,1,ILLS,0,NA,0,"written permission","contact ILLS herbarium for additional information about this record",
275301,"Philadelphus coronarius",,,"ILLS (INHS Herbarium)",1977-06-14,CHAMPAIGN,"herbarium specimen",high,"S.T. Layden","Accession: 158522",,0,1,ILLS,0,NA,0,"written permission","contact ILLS herbarium for additional information about this record",
275302,"Philadelphus coronarius",,,"ILLS (INHS Herbarium)",1971-07-22,CHAMPAIGN,"herbarium specimen",high,"Betty Nelson & Barbara Little","Accession: 148232",,0,1,ILLS,0,NA,0,"written permission","contact ILLS herbarium for additional information about this record",
275303,"Philadelphus coronarius",,,"ILLS (INHS Herbarium)",1971-06-09,CHAMPAIGN,"herbarium specimen",high,"Betty Nelson & Barbara Little","Accession: 148231",,0,1,ILLS,0,NA,0,"written permission","contact ILLS herbarium for additional information about this record",
275304,"Philadelphus coronarius",,,"ILLS (INHS Herbarium)",1971-06-09,CHAMPAIGN,"herbarium specimen",high,"Betty Nelson & Barbara Little Det: The Arnold Arboretum","Accession: 142525",,0,1,ILLS,0,NA,0,"written permission","contact ILLS herbarium for additional information about this record",
275305,"Philadelphus coronarius",,,"ILLS (INHS Herbarium)",1954-06-15,COOK,"herbarium specimen",high,"H.R. Bennett","Accession: 67098",,0,1,ILLS,0,NA,0,"written permission","contact ILLS herbarium for additional information about this record",
275306,"Philadelphus coronarius",,,"ILLS (INHS Herbarium)",1966-06-17,CRAWFORD,"herbarium specimen",high,"R.A. Evers","Accession: 126284",,0,1,ILLS,0,NA,0,"written permission","contact ILLS herbarium for additional information about this record",
275307,"Philadelphus coronarius",,,"ILLS (INHS Herbarium)",1940-08-13,UNION,"herbarium specimen",high,"Geo. D. Fuller","Accession: 13896",,0,1,ILLS,0,NA,0,"written permission","contact ILLS herbarium for additional information about this record",
275308,"Philadelphus coronarius",,,"ILLS (INHS Herbarium)",1940-08-13,UNION,"herbarium specimen",high,"Geo. D. Fuller & Ralph Fisher","Accession: 105390",,0,1,ILLS,0,NA,0,"written permission","contact ILLS herbarium for additional information about this record",
279485,"Philadelphus coronarius",,,"ILLS (INHS Herbarium)",1982-10-05,JACKSON,"herbarium specimen",high,"Trent & Robert Mohlenbrock","Accession: 187607",,0,1,ILLS,0,NA,0,"written permission","contact ILLS herbarium for additional information about this record",
279486,"Philadelphus coronarius",,,"ILLS (INHS Herbarium)",1982-10-28,PEORIA,"herbarium specimen",high,"I. M. Cull","Accession: 187608",,0,1,ILLS,0,NA,0,"written permission","contact ILLS herbarium for additional information about this record",
279487,"Philadelphus coronarius",,,"ILLS (INHS Herbarium)",0000-00-00,PEORIA,"herbarium specimen",high,"I. M. Cull","Accession: 187609",,0,1,ILLS,0,NA,0,"written permission","contact ILLS herbarium for additional information about this record",
367812,"Philadelphus coronarius",,,"ILLS (INHS Herbarium)",1995-06-21,KANE,"herbarium specimen",high,"Steven R. Hill Det.: Steven R. Hill (ILLS) September 1995","Accession: 191472",,0,1,ILLS,0,NA,0,"written permission","contact ILLS herbarium for additional information about this record",
374803,"Philadelphus coronarius",,,"ILLS (INHS Herbarium)",2000-07-06,JACKSON,"herbarium specimen",high,"Mark A. Basinger","Accession: 203745",,0,1,ILLS,0,NA,0,"written permission","contact ILLS herbarium for additional information about this record",
481413,"Philadelphus coronarius",,,ILPIN,,COOK,,medium,,,,,,,,,0,,,
567244,"Philadelphus coronarius",41.388018,-88.237847,"Forest Preserve Dist. Will County",1995-00-00,WILL,,medium,Various,"McKinley Woods (MWP)",,0,1,,,,0,,"FPDWC master database recrod, which contains a mix of reports, observations, and studies. Further information regarding individual records may be available upon request.",
567245,"Philadelphus coronarius",41.264775,-88.164544,"Forest Preserve Dist. Will County",2010-00-00,WILL,,medium,Various,"Kankakee Sands Preserve (KSP)",,0,1,,,,0,,"FPDWC master database recrod, which contains a mix of reports, observations, and studies. Further information regarding individual records may be available upon request.",
567246,"Philadelphus coronarius",41.515713,-87.880083,"Forest Preserve Dist. Will County",2012-00-00,WILL,,medium,Various,"Hickory Creek Preserve (HCP)",,0,1,,,,0,,"FPDWC master database recrod, which contains a mix of reports, observations, and studies. Further information regarding individual records may be available upon request.",
567247,"Philadelphus coronarius",41.404353,-87.601152,"Forest Preserve Dist. Will County",1996-00-00,WILL,,medium,Various,"Goodenow Grove Nature Preserve (GGN)",,0,1,,,,0,,"FPDWC master database recrod, which contains a mix of reports, observations, and studies. Further information regarding individual records may be available upon request.",
567248,"Philadelphus coronarius",41.264663,-88.112795,"Forest Preserve Dist. Will County",2003-00-00,WILL,,medium,Various,"Forked Creek Preserve (FCP)",,0,1,,,,0,,"FPDWC master database recrod, which contains a mix of reports, observations, and studies. Further information regarding individual records may be available upon request.",
