occurrence_id,speciesID,latitude,longitude,donorDatabase,collectionDate,county,recordType,confidence,botanist,projectIdentifier,geoPrecision,truncate,voucher,voucherLocation,verified,weblink,planted,rights,notes,added_date
245711,"Allium canadense var. mobilense",,,"ILLS (INHS Herbarium)",1952-06-05,JOHNSON,"herbarium specimen",high,"John W. Voigt","Accession: 49548",,0,1,ILLS,0,NA,0,"written permission","contact ILLS herbarium for additional information about this record",
367751,"Allium canadense var. mobilense",,,"ILLS (INHS Herbarium)",1995-06-06,SALINE,"herbarium specimen",high,"Steven R. Hill with Loy R. Phillippe Det.: Stevern R. Hill (ILLS) September 1995","Accession: 191598",,0,1,ILLS,0,NA,0,"written permission","contact ILLS herbarium for additional information about this record",
543201,"Allium canadense var. mobilense",,,ILPIN,,DUPAGE,,medium,,,,,,,,,0,,,
543202,"Allium canadense var. mobilense",,,ILPIN,,GREENE,,medium,,,,,,,,,0,,,
543203,"Allium canadense var. mobilense",,,ILPIN,,JACKSON,,medium,,,,,,,,,0,,,
543204,"Allium canadense var. mobilense",,,ILPIN,,JEFFERSON,,medium,,,,,,,,,0,,,
543205,"Allium canadense var. mobilense",,,ILPIN,,JOHNSON,,medium,,,,,,,,,0,,,
543206,"Allium canadense var. mobilense",,,ILPIN,,KANE,,medium,,,,,,,,,0,,,
543207,"Allium canadense var. mobilense",,,ILPIN,,MASON,,medium,,,,,,,,,0,,,
543208,"Allium canadense var. mobilense",,,ILPIN,,POPE,,medium,,,,,,,,,0,,,
543209,"Allium canadense var. mobilense",,,ILPIN,,RANDOLPH,,medium,,,,,,,,,0,,,
543210,"Allium canadense var. mobilense",,,ILPIN,,WILL,,medium,,,,,,,,,0,,,
741686,"Allium canadense var. mobilense",39.571202,-88.43867,CTAP,2016-05-18,COLES,"professional survey",med-high,Rye_Timothy,110101F,50,0,,INHS,,http://wwx.inhs.illinois.edu/research/ctap/,0,,,
809334,"Allium canadense var. mobilense",40.569966,-88.669859,CTAP,2016-05-19,MCLEAN,"professional survey",med-high,Ellis_James,067201F,50,0,,INHS,,http://wwx.inhs.illinois.edu/research/ctap/,0,,,
832056,"Allium canadense var. mobilense",38.253567,-89.220383,CTAP,2016-05-25,WASHINGTON,"professional survey",med-high,Rye_Timothy,153802F,50,0,,INHS,,http://wwx.inhs.illinois.edu/research/ctap/,0,,,
836749,"Allium canadense var. mobilense",38.283809,-88.505904,CTAP,2016-05-24,WAYNE,"professional survey",med-high,Ellis_James,154601F,50,0,,INHS,,http://wwx.inhs.illinois.edu/research/ctap/,0,,,
